Thread Rating:
  • 0 Vote(s) - 0 Average
  • 1
  • 2
  • 3
  • 4
  • 5
OSX Build Problem
#1
Failed to make in latest version with error below

[ 57%] Building CXX object CMakeFiles/Core.dir/Core/CoreTiming.cpp.o
/Users/ppsspp/Core/Config.cpp:62:47: error: use of undeclared identifier
'SYSPROP_LANGREGION'
std:Confusedtring langRegion = System_GetProperty(SYSPROP_LANGREGION);
^
/Users/ppsspp/Core/Config.cpp:63:16: error: no member named 'IniExists'
in 'I18NRepo'
if (i18nrepo.IniExists(langRegion))
~~~~~~~~ ^
2 errors generated.
make[2]: *** [CMakeFiles/Core.dir/Core/Config.cpp.o] Error 1
make[2]: *** Waiting for unfinished jobs....
make[1]: *** [CMakeFiles/Core.dir/all] Error 2
make: *** [all] Error 2
Reply
#2
Sounds like you did not run git submodule update.

-[Unknown]
Reply
#3
As What you said.
Thank you
Reply


Forum Jump: