Search Results
Post Author Forum Replies Views Posted [asc]
  Thread: Compile Error in OSX 10.9
Post: RE: Compile Error in OSX 10.9

Thank you for response I tried it in Mac OSX 10.9 (x86) with brew QT
psh1977 Builds, releases and ports 2 6,429 12-14-2013, 10:53 AM
  Thread: Compile Error in OSX 10.9
Post: Compile Error in OSX 10.9

Compile Error in OSX 10.9 with xcode 5.0.2 like below error ../Core/MIPS/ARM/ArmAsm.cpp:103:14: error: cast from pointer to smaller type 'u32' (aka 'unsigned int') loses information MOV...
psh1977 Builds, releases and ports 2 6,429 12-14-2013, 03:51 AM
  Thread: OPENGL_INCLUDE_DIR not found in OSX
Post: OPENGL_INCLUDE_DIR not found in OSX

Buliding was failed with OPENGL_INCLUDE_DIR not found in OSX 10.9 I heard lib path is different from Linux
psh1977 Development 0 2,453 11-03-2013, 11:34 AM
  Thread: No rule to make target '/usr/lib/libSDLmain.a'
Post: RE: No rule to make target '/usr/lib/libSDLmain.a'

Thank you for reply In Arch Linux, No libSDLmain.a in sdl , but exists in lib32-sdl (but Path is /usr/lib32/libSDLmain.a) And lib32-sdl is only for x86_64 system Thank you
psh1977 Builds, releases and ports 4 8,904 10-26-2013, 11:14 PM
  Thread: No rule to make target '/usr/lib/libSDLmain.a'
Post: No rule to make target '/usr/lib/libSDLmain.a'

Failed to make in Linux environment. make[2]: *** No rule to make target '/usr/lib/libSDLmain.a', needed by 'PPSSPPSDL'. Stop. make[2]: *** Waiting for unfinished jobs.... [100%] Building CXX object...
psh1977 Builds, releases and ports 4 8,904 10-26-2013, 03:58 PM
  Thread: OSX Build Problem
Post: RE: OSX Build Problem

As What you said. Thank you
psh1977 Builds, releases and ports 2 5,148 09-06-2013, 02:46 PM
  Thread: OSX Build Problem
Post: OSX Build Problem

Failed to make in latest version with error below [ 57%] Building CXX object CMakeFiles/Core.dir/Core/CoreTiming.cpp.o /Users/ppsspp/Core/Config.cpp:62:47: error: use of undeclared identifier '...
psh1977 Builds, releases and ports 2 5,148 09-06-2013, 12:45 PM
  Thread: Sound is dropped continuously When pulse is set Simultaneous output
Post: Sound is dropped continuously When pulse is set Si...

Sound is dropped continuously When pulse is set Simultaneous output to Built-in Audio I'm using version 0.9.1 in Arch Linux x86(kernel is 3.10.10-1-ARCH) 00:1f.5 Multimedia audio controller: Intel Co...
psh1977 Development 0 2,100 08-31-2013, 07:24 PM
  Thread: Failed to make in Linux(x86)
Post: RE: Failed to make in Linux(x86)

Could not imported in same Directory with PPSSPPSDL Success to import when put it in /usr/lib directory. But, Sound was too choppy
psh1977 Builds, releases and ports 6 9,693 08-27-2013, 01:45 PM
  Thread: Failed to make in Linux(x86)
Post: RE: Failed to make in Linux(x86)

Thank you for advice Success to make after compiling ffmpeg But, There was no sound in Linux enviroment. Atrac3+ decoder is not available in Linux? I cound not find any clue in other threads (08-26...
psh1977 Builds, releases and ports 6 9,693 08-26-2013, 09:27 PM
  Thread: Failed to make in Linux(x86)
Post: Failed to make in Linux(x86)

Failed to make in Linux(x86) Linking CXX executable PPSSPPSDL /home/Downloads/ppsspp/ffmpeg/linux/x86_64/lib/libavformat.a: could not read symbols: File format not recognized collect2: error: ld ret...
psh1977 Builds, releases and ports 6 9,693 08-26-2013, 12:51 PM