| Welcome, Guest |
You have to register before you can post on our site.
|
| Online Users |
There are currently 1319 online users. » 0 Member(s) | 1315 Guest(s) Applebot, Baidu, DuckDuckGo, Google
|
| Latest Threads |
Monster Hunter Freedom Un...
Forum: CWCheat codes
Last Post: Kaidou
1 hour ago
» Replies: 128
» Views: 1,355,754
|
Error code 8002013a
Forum: Ad-Hoc Multiplayer
Last Post: AlexKoragon
10-21-2026, 12:28 AM
» Replies: 0
» Views: 27
|
Error code 8002013a
Forum: Ad-Hoc Multiplayer
Last Post: AlexKoragon
10-20-2026, 09:16 PM
» Replies: 0
» Views: 26
|
Error code 8002013a
Forum: Ad-Hoc Multiplayer
Last Post: AlexKoragon
10-20-2026, 09:12 PM
» Replies: 0
» Views: 22
|
Dissidia 012: Duodecim Fi...
Forum: Playable Games
Last Post: MatNyaga
10-20-2026, 09:17 AM
» Replies: 1,103
» Views: 4,264,161
|
60 FPS Patches Master Lis...
Forum: CWCheat codes
Last Post: Fran535
10-17-2026, 10:27 AM
» Replies: 116
» Views: 2,373,024
|
Valkyria Chronicles 3 Ext...
Forum: Texture Packs
Last Post: chrome99001
10-15-2026, 02:19 PM
» Replies: 22
» Views: 69,858
|
Peace Walker Glitch
Forum: General Discussion and Announcements
Last Post: JuggleR
10-15-2026, 04:29 AM
» Replies: 0
» Views: 28
|
Resistance: Retribution
Forum: In-game
Last Post: LunaMoo
10-15-2026, 03:32 AM
» Replies: 78
» Views: 387,418
|
[ULES01183] Yu-Gi-Oh GX T...
Forum: Texture Packs
Last Post: Moki.all.Games
10-15-2026, 12:12 AM
» Replies: 0
» Views: 190
|
|
|
| Psp Bios and Psp Mini game list clips. |
|
Posted by: kouta-kun - 11-10-2012, 03:35 AM - Forum: General Discussion and Announcements
- Replies (2)
|
 |
I know that there is not much of a practical purpose to having the psp interface as part of the emulator, but as a proof of concept/style points thing, do you think at any point in time its worth implementing?
Also right now there is an emulator rom selection similar to any other, but the psp did have mini clips for most games, have you ever thought about implementing this?
|
|
|
| Donation |
|
Posted by: trev186 - 11-06-2012, 02:48 PM - Forum: General Discussion and Announcements
- Replies (2)
|
 |
Any thoughts of setting up a paypal link we can donate to to u with ?
I understand not putting this on play store for android since it is very early build but I would like to throw some cash at ya for the work so far
|
|
|
| I found a game to play (PSP Demo) but..................... |
|
Posted by: ThinkingDude188 - 11-06-2012, 06:31 AM - Forum: General Discussion and Announcements
- Replies (3)
|
 |
I was looking through all of these threads talking about what game it supports but there was none that went so well(Except that puzzle game I saw in the video). I think for a long time until I did came up with an idea. Download the game as a elf file because the cube work well no bugs, lag, or anything. I was trying to look for a elf converter but there was none at all. Now I went go back thinking again then I had another idea download EBOOT.PBP files becasuse PSP's run those. I was thinking about download a full game but it would take so long. I went into a PSP Demo website and download Final Fantasy Dissda demo. Extract to a folder then put it in my download. Went to the PPSSPP to go play it. The folder was there and the file inside look like the cube file which meant to me this has to work. When I press it, it didn't send me into the game it said "Error loading file executale encrypted- not yet supported" Well now I'm out of ideas I hope this helps. :-)
|
|
|
| noob.. try to compile on linuxSORRY!!!! readagain! |
|
Posted by: naxil - 11-05-2012, 12:21 PM - Forum: General Discussion and Announcements
- Replies (3)
|
 |
EXUSEME!!! now i have read propa the readme! but i have this error ..
please look what i have do!
PPSPP on ubuntu 10.04 try to compile..
If is a problem of lib
"d development libraries for zlib and sdl."?? what version?
exist lot of different ver i think.. and i think i have it..
root@naxil-desktop:/home/naxil/homebrew# rm ppsspp/ -R
root@naxil-desktop:/home/naxil/homebrew# git clone http://github.com/hrydgard/ppsspp
Initialized empty Git repository in /home/naxil/homebrew/ppsspp/.git/
remote: Counting objects: 1181, done.
remote: Compressing objects: 100% (728/728), done.
remote: Total 1181 (delta 699), reused 913 (delta 431)
Receiving objects: 100% (1181/1181), 1.13 MiB | 199 KiB/s, done.
Resolving deltas: 100% (699/699), done.
root@naxil-desktop:/home/naxil/homebrew# git submodule init
fatal: Not a git repository (or any of the parent directories): .git
root@naxil-desktop:/home/naxil/homebrew# cd ppsspp/
root@naxil-desktop:/home/naxil/homebrew/ppsspp# git submodule init
Submodule 'native' (https://github.com/hrydgard/native.git) registered for path 'native'
root@naxil-desktop:/home/naxil/homebrew/ppsspp# git submodule update
Initialized empty Git repository in /home/naxil/homebrew/ppsspp/native/.git/
remote: Counting objects: 1703, done.
remote: Compressing objects: 100% (786/786), done.
remote: Total 1703 (delta 1089), reused 1444 (delta 830)
Receiving objects: 100% (1703/1703), 859.24 KiB | 171 KiB/s, done.
Resolving deltas: 100% (1089/1089), done.
Submodule path 'native': checked out 'b80e99726b5bda47f4a3165111295dc35337870d'
root@naxil-desktop:/home/naxil/homebrew/ppsspp# cd SDL
root@naxil-desktop:/home/naxil/homebrew/ppsspp/SDL# ls
b.sh build_for_playbook.sh README.TXT SDLMain.m
buildassets.sh CMakeLists.txt SDLMain.h
root@naxil-desktop:/home/naxil/homebrew/ppsspp/SDL# gedit README.TXT
root@naxil-desktop:/home/naxil/homebrew/ppsspp/SDL# ./buildassets.sh
root@naxil-desktop:/home/naxil/homebrew/ppsspp/SDL# ./b.sh
-- The C compiler identification is GNU
-- The CXX compiler identification is GNU
-- Check for working C compiler: /usr/bin/gcc
-- Check for working C compiler: /usr/bin/gcc -- works
-- Detecting C compiler ABI info
-- Detecting C compiler ABI info - done
-- Check for working CXX compiler: /usr/bin/c++
-- Check for working CXX compiler: /usr/bin/c++ -- works
-- Detecting CXX compiler ABI info
-- Detecting CXX compiler ABI info - done
-- Found ZLIB: /usr/lib/libz.so
-- Found PNG: /usr/lib/libpng.so
-- checking for module 'sdl'
-- found sdl, version 1.2.14
-- Looking for XOpenDisplay in /usr/lib/libX11.so;/usr/lib/libXext.so
-- Looking for XOpenDisplay in /usr/lib/libX11.so;/usr/lib/libXext.so - found
-- Looking for gethostbyname
-- Looking for gethostbyname - found
-- Looking for connect
-- Looking for connect - found
-- Looking for remove
-- Looking for remove - found
-- Looking for shmat
-- Looking for shmat - found
-- Looking for IceConnectionNumber in ICE
-- Looking for IceConnectionNumber in ICE - found
-- Found X11: /usr/lib/libX11.so
-- Looking for include files CMAKE_HAVE_PTHREAD_H
-- Looking for include files CMAKE_HAVE_PTHREAD_H - found
-- Looking for pthread_create in pthreads
-- Looking for pthread_create in pthreads - not found
-- Looking for pthread_create in pthread
-- Looking for pthread_create in pthread - found
-- Found Threads: TRUE
-- Configuring done
-- Generating done
-- Build files have been written to: /home/naxil/homebrew/ppsspp/SDL/build
Scanning dependencies of target base
Scanning dependencies of target common
Scanning dependencies of target zip
[ 0%] Building CXX object base/CMakeFiles/base.dir/colorutil.cpp.o
[ 0%] Building CXX object Common/CMakeFiles/common.dir/Action.cpp.o
[ 1%] Building C object libzip/CMakeFiles/zip.dir/mkstemp.c.o
[ 1%] Building CXX object base/CMakeFiles/base.dir/timeutil.cpp.o
/home/naxil/homebrew/ppsspp/native/ext/libzip/mkstemp.c: In function ‘_zip_mkstemp’:
/home/naxil/homebrew/ppsspp/native/ext/libzip/mkstemp.c:66: warning: implicit declaration of function ‘getpid’
[ 2%] Building CXX object Common/CMakeFiles/common.dir/ColorUtil.cpp.o
[ 2%] In file included from /home/naxil/homebrew/ppsspp/Common/CommonFuncs.h:40,
from /home/naxil/homebrew/ppsspp/Common/Common.h:58,
from /home/naxil/homebrew/ppsspp/Common/ColorUtil.cpp:18:
/usr/lib/gcc/i486-linux-gnu/4.4.3/include/emmintrin.h:32:3: error: #error "SSE2 instruction set not enabled"
Building C object libzip/CMakeFiles/zip.dir/zip_add.c.o
[ 3%] Building CXX object base/CMakeFiles/base.dir/threadutil.cpp.o
[ 4%] Building C object libzip/CMakeFiles/zip.dir/zip_add_dir.c.o
In file included from /home/naxil/homebrew/ppsspp/Common/Common.h:58,
from /home/naxil/homebrew/ppsspp/Common/ColorUtil.cpp:18:
/home/naxil/homebrew/ppsspp/Common/CommonFuncs.h:42: error: expected initializer before ‘_mm_shuffle_epi8’
make[2]: *** [Common/CMakeFiles/common.dir/ColorUtil.cpp.o] Errore 1
make[1]: *** [Common/CMakeFiles/common.dir/all] Errore 2
make[1]: *** Attesa per i processi non terminati....
[ 4%] [ 4%] Building C object libzip/CMakeFiles/zip.dir/zip_delete.c.o
Building C object libzip/CMakeFiles/zip.dir/zip_close.c.o
[ 4%] [ 5%] Building CXX object base/CMakeFiles/base.dir/error_context.cpp.o
Building C object libzip/CMakeFiles/zip.dir/zip_dirent.c.o
[ 5%] Building C object libzip/CMakeFiles/zip.dir/zip_entry_free.c.o
[ 6%] Building C object libzip/CMakeFiles/zip.dir/zip_entry_new.c.o
[ 6%] Building C object libzip/CMakeFiles/zip.dir/zip_err_str.c.o
[ 7%] Building C object libzip/CMakeFiles/zip.dir/zip_error.c.o
[ 7%] Building C object libzip/CMakeFiles/zip.dir/zip_error_clear.c.o
[ 8%] [ 9%] Building C object libzip/CMakeFiles/zip.dir/zip_error_get.c.o
Building CXX object base/CMakeFiles/base.dir/display.cpp.o
[ 9%] Building C object libzip/CMakeFiles/zip.dir/zip_error_get_sys_type.c.o
[ 9%] Building CXX object base/CMakeFiles/base.dir/PCMain.cpp.o
[ 9%] Building C object libzip/CMakeFiles/zip.dir/zip_error_strerror.c.o
[ 10%] Building C object libzip/CMakeFiles/zip.dir/zip_error_to_str.c.o
[ 10%] Building C object libzip/CMakeFiles/zip.dir/zip_fclose.c.o
In file included from /home/naxil/homebrew/ppsspp/native/base/PCMain.cpp:24:
/home/naxil/homebrew/ppsspp/SDL/../native/gfx_es2/glsl_program.h:11:21: error: GL/glew.h: File o directory non esistente
[ 11%] Building C object libzip/CMakeFiles/zip.dir/zip_file_error_clear.c.o
[ 11%] Building C object libzip/CMakeFiles/zip.dir/zip_file_error_get.c.o
[ 12%] Building C object libzip/CMakeFiles/zip.dir/zip_file_get_offset.c.o
[ 12%] Building C object libzip/CMakeFiles/zip.dir/zip_file_strerror.c.o
[ 13%] [ 13%] Building C object libzip/CMakeFiles/zip.dir/zip_filerange_crc.c.o
Building C object libzip/CMakeFiles/zip.dir/zip_fopen.c.o
[ 14%] [ 14%] Building C object libzip/CMakeFiles/zip.dir/zip_fopen_index.c.o
Building C object libzip/CMakeFiles/zip.dir/zip_fread.c.o
/home/naxil/homebrew/ppsspp/native/base/PCMain.cpp: In function ‘int main(int, char**)’:
/home/naxil/homebrew/ppsspp/native/base/PCMain.cpp:214: error: ‘GLEW_OK’ was not declared in this scope
/home/naxil/homebrew/ppsspp/native/base/PCMain.cpp:214: error: ‘glewInit’ was not declared in this scope
/home/naxil/homebrew/ppsspp/native/base/PCMain.cpp:219: error: ‘GLEW_VERSION_2_0’ was not declared in this scope
[ 14%] Building C object libzip/CMakeFiles/zip.dir/zip_free.c.o
make[2]: *** [base/CMakeFiles/base.dir/PCMain.cpp.o] Errore 1
make[1]: *** [base/CMakeFiles/base.dir/all] Errore 2
[ 15%] [ 15%] Building C object libzip/CMakeFiles/zip.dir/zip_get_archive_comment.c.o
Building C object libzip/CMakeFiles/zip.dir/zip_get_archive_flag.c.o
[ 16%] Building C object libzip/CMakeFiles/zip.dir/zip_get_file_comment.c.o
[ 17%] [ 17%] Building C object libzip/CMakeFiles/zip.dir/zip_get_num_files.c.o
Building C object libzip/CMakeFiles/zip.dir/zip_get_name.c.o
[ 17%] [ 18%] Building C object libzip/CMakeFiles/zip.dir/zip_memdup.c.o
Building C object libzip/CMakeFiles/zip.dir/zip_name_locate.c.o
[ 18%] Building C object libzip/CMakeFiles/zip.dir/zip_new.c.o
[ 18%] Building C object libzip/CMakeFiles/zip.dir/zip_open.c.o
[ 19%] Building C object libzip/CMakeFiles/zip.dir/zip_rename.c.o
[ 19%] Building C object libzip/CMakeFiles/zip.dir/zip_replace.c.o
[ 20%] [ 20%] Building C object libzip/CMakeFiles/zip.dir/zip_set_archive_comment.c.o
Building C object libzip/CMakeFiles/zip.dir/zip_set_archive_flag.c.o
[ 21%] Building C object libzip/CMakeFiles/zip.dir/zip_set_file_comment.c.o
[ 21%] [ 22%] Building C object libzip/CMakeFiles/zip.dir/zip_set_name.c.o
Building C object libzip/CMakeFiles/zip.dir/zip_source_buffer.c.o
[ 22%] Building C object libzip/CMakeFiles/zip.dir/zip_source_file.c.o
[ 23%] Building C object libzip/CMakeFiles/zip.dir/zip_source_filep.c.o
[ 23%] Building C object libzip/CMakeFiles/zip.dir/zip_source_free.c.o
[ 23%] Building C object libzip/CMakeFiles/zip.dir/zip_source_function.c.o
[ 24%] Building C object libzip/CMakeFiles/zip.dir/zip_source_zip.c.o
[ 24%] Building C object libzip/CMakeFiles/zip.dir/zip_stat.c.o
[ 25%] Building C object libzip/CMakeFiles/zip.dir/zip_stat_index.c.o
[ 25%] Building C object libzip/CMakeFiles/zip.dir/zip_stat_init.c.o
[ 26%] Building C object libzip/CMakeFiles/zip.dir/zip_strerror.c.o
[ 26%] Building C object libzip/CMakeFiles/zip.dir/zip_unchange.c.o
[ 27%] Building C object libzip/CMakeFiles/zip.dir/zip_unchange_all.c.o
[ 27%] Building C object libzip/CMakeFiles/zip.dir/zip_unchange_archive.c.o
[ 28%] Building C object libzip/CMakeFiles/zip.dir/zip_unchange_data.c.o
Linking C static library libzip.a
[ 28%] Built target zip
make: *** [all] Errore 2
sorry.. for before.. i haven't read the readme!!! please helpme!
|
|
|
|